BDBM181963 US9145380, 166
SMILES Cc1ccncc1-c1cccc(c1)S(=O)(=O)Nc1ccccc1S(N)(=O)=O
InChI Key InChIKey=GDNJVCUHTQDFMS-UHFFFAOYSA-N
Data  1 IC50
  Tab Delimited (TSV)   2D SDfile   Computed 3D by Vconf -m prep SDfile
Find this compound or compounds like it in BindingDB:
Activity Spreadsheet -- Enzyme Inhibition Constant Data from BindingDB
Found 1 hit for monomerid = 181963
TargetProstaglandin E synthase 2(Homo sapiens (Human))
Astrazeneca
US Patent
LigandPNGBDBM181963(US9145380, 166)
Affinity DataIC50:  4.80E+3nMpH: 6.8Assay Description:A solution of test compound was added to a diluted microsome preparation containing human mPGES-1 and pre-incubated for 15 minutes in potassium phosp...
In DepthDetails US Patent