BDBM181968 US9145380, 171
SMILES NS(=O)(=O)c1ccccc1NS(=O)(=O)c1cccc(c1)-c1cccc(CO)c1
InChI Key InChIKey=FFSWWBCBRBSNIN-UHFFFAOYSA-N
Data  1 IC50
  Tab Delimited (TSV)   2D SDfile   Computed 3D by Vconf -m prep SDfile
Find this compound or compounds like it in BindingDB:
Activity Spreadsheet -- Enzyme Inhibition Constant Data from BindingDB
Found 1 hit for monomerid = 181968
TargetProstaglandin E synthase 2(Homo sapiens (Human))
Astrazeneca
US Patent
LigandPNGBDBM181968(US9145380, 171)
Affinity DataIC50:  1.70E+3nMpH: 6.8Assay Description:A solution of test compound was added to a diluted microsome preparation containing human mPGES-1 and pre-incubated for 15 minutes in potassium phosp...
In DepthDetails US Patent