BDBM181985 US9145380, 188
SMILES NS(=O)(=O)c1ccccc1NS(=O)(=O)CCc1ccc(nc1)C#CC1CCCCC1
InChI Key InChIKey=YKYLTLDRANIQSC-UHFFFAOYSA-N
Data  1 IC50
  Tab Delimited (TSV)   2D SDfile   Computed 3D by Vconf -m prep SDfile
Find this compound or compounds like it in BindingDB:
Activity Spreadsheet -- Enzyme Inhibition Constant Data from BindingDB
Found 1 hit for monomerid = 181985
TargetProstaglandin E synthase 2(Homo sapiens (Human))
Astrazeneca
US Patent
LigandPNGBDBM181985(US9145380, 188)
Affinity DataIC50:  270nMpH: 6.8Assay Description:A solution of test compound was added to a diluted microsome preparation containing human mPGES-1 and pre-incubated for 15 minutes in potassium phosp...
In DepthDetails US Patent