BDBM181988 US9145380, 191
SMILES Cc1nc(cs1)-c1cccc(c1)S(=O)(=O)Nc1ccccc1S(N)(=O)=O
InChI Key InChIKey=NLEIGGGHAMBEGX-UHFFFAOYSA-N
Data  1 IC50
  Tab Delimited (TSV)   2D SDfile   Computed 3D by Vconf -m prep SDfile
Find this compound or compounds like it in BindingDB:
Activity Spreadsheet -- Enzyme Inhibition Constant Data from BindingDB
Found 1 hit for monomerid = 181988
TargetProstaglandin E synthase 2(Homo sapiens (Human))
Astrazeneca
US Patent
LigandPNGBDBM181988(US9145380, 191)
Affinity DataIC50:  8.30E+3nMpH: 6.8Assay Description:A solution of test compound was added to a diluted microsome preparation containing human mPGES-1 and pre-incubated for 15 minutes in potassium phosp...
Ligand InfoPC cidPC sid
In DepthDetails US Patent