BDBM182024 US9145380, 227
SMILES COc1ccccc1CCS(=O)(=O)Nc1cc(Cl)ccc1S(N)(=O)=O
InChI Key InChIKey=QQFDTOOHEWWDFO-UHFFFAOYSA-N
Data  1 IC50
  Tab Delimited (TSV)   2D SDfile   Computed 3D by Vconf -m prep SDfile
Find this compound or compounds like it in BindingDB:
Activity Spreadsheet -- Enzyme Inhibition Constant Data from BindingDB
Found 1 hit for monomerid = 182024
TargetProstaglandin E synthase 2(Homo sapiens (Human))
Astrazeneca
US Patent
LigandPNGBDBM182024(US9145380, 227)
Affinity DataIC50:  1.90E+3nMpH: 6.8Assay Description:A solution of test compound was added to a diluted microsome preparation containing human mPGES-1 and pre-incubated for 15 minutes in potassium phosp...
In DepthDetails US Patent