BDBM182031 US9145380, 234
SMILES NS(=O)(=O)c1c2CCCc2ccc1NS(=O)(=O)CCc1ccc(cc1)-c1ccco1
InChI Key InChIKey=NGTLUSPFNXFAIH-UHFFFAOYSA-N
Data  1 IC50
  Tab Delimited (TSV)   2D SDfile   Computed 3D by Vconf -m prep SDfile
Find this compound or compounds like it in BindingDB:
Activity Spreadsheet -- Enzyme Inhibition Constant Data from BindingDB
Found 1 hit for monomerid = 182031
TargetProstaglandin E synthase 2(Homo sapiens (Human))
Astrazeneca
US Patent
LigandPNGBDBM182031(US9145380, 234)
Affinity DataIC50:  6.20E+3nMpH: 6.8Assay Description:A solution of test compound was added to a diluted microsome preparation containing human mPGES-1 and pre-incubated for 15 minutes in potassium phosp...
In DepthDetails US Patent