BDBM182036 US9145380, 239
SMILES CNS(=O)(=O)c1ccccc1NS(=O)(=O)c1cccc(c1)-c1ccc(Cl)c(Cl)c1
InChI Key InChIKey=YIIIGFOFCJCKBI-UHFFFAOYSA-N
Data  1 IC50
  Tab Delimited (TSV)   2D SDfile   Computed 3D by Vconf -m prep SDfile
Find this compound or compounds like it in BindingDB:
Activity Spreadsheet -- Enzyme Inhibition Constant Data from BindingDB
Found 1 hit for monomerid = 182036
TargetProstaglandin E synthase 2(Homo sapiens (Human))
Astrazeneca
US Patent
LigandPNGBDBM182036(US9145380, 239)
Affinity DataIC50:  6.06E+3nMpH: 6.8Assay Description:A solution of test compound was added to a diluted microsome preparation containing human mPGES-1 and pre-incubated for 15 minutes in potassium phosp...
In DepthDetails US Patent