BDBM182777 US9145414, 57
SMILES N[C@H]1CCCC[C@H]1Nc1nnc(C(N)=O)c(Nc2ccc3nn(cc3c2)C(F)F)n1
InChI Key InChIKey=XYFCYFFJZRCQOI-WCQYABFASA-N
Data  1 IC50
  Tab Delimited (TSV)   2D SDfile   Computed 3D by Vconf -m prep SDfile
Find this compound or compounds like it in BindingDB:
Activity Spreadsheet -- Enzyme Inhibition Constant Data from BindingDB
Found 1 hit for monomerid = 182777
TargetTyrosine-protein kinase SYK(Homo sapiens (Human))
Taiho Pharmaceutical
US Patent
LigandPNGBDBM182777(US9145414, 57)
Affinity DataIC50:  0.520nMpH: 7.5 T: 2°C. Assay description: The in vitro inhibitory activity of the compound of the present invention against Syk kinase activity was assayed under the following conditions: the...
In DepthDetails US Patent