BDBM182779 US9145414, 61
SMILES Cc1cc(Nc2nc(N[C@@H]3CCOC[C@@H]3N)nnc2C(N)=O)cc2cn(nc12)C(C)(C)C
InChI Key InChIKey=ATERGQQFFHVNOJ-LSDHHAIUSA-N
Data  1 IC50
  Tab Delimited (TSV)   2D SDfile   Computed 3D by Vconf -m prep SDfile
Find this compound or compounds like it in BindingDB:
Activity Spreadsheet -- Enzyme Inhibition Constant Data from BindingDB
Found 1 hit for monomerid = 182779
TargetTyrosine-protein kinase SYK(Homo sapiens (Human))
Taiho Pharmaceutical
US Patent
LigandPNGBDBM182779(US9145414, 61)
Affinity DataIC50:  0.370nMpH: 7.5 T: 2°C. Assay description: The in vitro inhibitory activity of the compound of the present invention against Syk kinase activity was assayed under the following conditions: the...
In DepthDetails US Patent