BDBM182793 US9145414, 100
SMILES CC(C)(C)n1cc2cc(Nc3nc(N[C@@H]4CCOC[C@@H]4N)nnc3C(N)=O)cc(Cl)c2n1
InChI Key InChIKey=WHLRDMOHBMFATC-UONOGXRCSA-N
Data  1 IC50
  Tab Delimited (TSV)   2D SDfile   Computed 3D by Vconf -m prep SDfile
Find this compound or compounds like it in BindingDB:
Activity Spreadsheet -- Enzyme Inhibition Constant Data from BindingDB
Found 1 hit for monomerid = 182793
TargetTyrosine-protein kinase SYK(Homo sapiens (Human))
Taiho Pharmaceutical
US Patent
LigandPNGBDBM182793(US9145414, 100)
Affinity DataIC50:  0.410nMpH: 7.5 T: 2°C. Assay description: The in vitro inhibitory activity of the compound of the present invention against Syk kinase activity was assayed under the following conditions: the...
In DepthDetails US Patent