BDBM182796 US9145414, 154
SMILES CCn1ncc2ccc(Nc3nc(N[C@@H]4CCCC[C@@H]4N)nnc3C(N)=O)cc12
InChI Key InChIKey=POFASODZNVQVKE-UONOGXRCSA-N
Data  1 IC50
  Tab Delimited (TSV)   2D SDfile   Computed 3D by Vconf -m prep SDfile
Find this compound or compounds like it in BindingDB:
Activity Spreadsheet -- Enzyme Inhibition Constant Data from BindingDB
Found 1 hit for monomerid = 182796
TargetTyrosine-protein kinase SYK(Homo sapiens (Human))
Taiho Pharmaceutical
US Patent
LigandPNGBDBM182796(US9145414, 154)
Affinity DataIC50:  0.430nMpH: 7.5 T: 2°C. Assay description: The in vitro inhibitory activity of the compound of the present invention against Syk kinase activity was assayed under the following conditions: the...
In DepthDetails US Patent