BDBM185739 US9162991, 15a
SMILES [O-][N+](=O)c1ccc(\C=C\C(=O)n2nnc3ccccc23)cc1
InChI Key InChIKey=WXODEYSEIORMEL-JXMROGBWSA-N
Data  1 IC50
  Tab Delimited (TSV)   2D SDfile   Computed 3D by Vconf -m prep SDfile
Find this compound or compounds like it in BindingDB:
Activity Spreadsheet -- Enzyme Inhibition Constant Data from BindingDB
Found 1 hit for monomerid = 185739
TargetProtein-glutamine gamma-glutamyltransferase 2(Cavia cutleri (Guinea pig))
University of Ottawa
US Patent
LigandPNGBDBM185739(US9162991, 15a)
Affinity DataIC50: >5.00E+4nM. Assay description: For enzymology studies of these compounds, recombinant guinea pig liver TGase was expressed in Escherichia coli and effectively purified (Gillet, S. ...
In DepthDetails US Patent