BDBM185767 US9162991, 14a
SMILES [O-]n1n[n+](C(=O)\C=C\c2ccc(cc2)N(=O)=O)c2ccccc12
InChI Key InChIKey=OCMUQKNWDSZVQL-JXMROGBWSA-N
Data  1 IC50
  Tab Delimited (TSV)   2D SDfile   Computed 3D by Vconf -m prep SDfile
Find this compound or compounds like it in BindingDB:
Activity Spreadsheet -- Enzyme Inhibition Constant Data from BindingDB
Found 1 hit for monomerid = 185767
TargetProtein-glutamine gamma-glutamyltransferase 2(Cavia cutleri (Guinea pig))
University of Ottawa
US Patent
LigandPNGBDBM185767(US9162991, 14a)
Affinity DataIC50:  4.30E+4nM. Assay description: For enzymology studies of these compounds, recombinant guinea pig liver TGase was expressed in Escherichia coli and effectively purified (Gillet, S. ...
In DepthDetails US Patent