BDBM186047 US9163011, 1
SMILES Cc1cc(cnc1C(=O)Nc1ccc(F)c(n1)[C@@]1(C)N=C(N)OCC1(F)F)C#N
InChI Key InChIKey=ISXCJKRNXUQSFB-QGZVFWFLSA-N
Data  3 IC50
  Tab Delimited (TSV)   2D SDfile   Computed 3D by Vconf -m prep SDfile
Find this compound or compounds like it in BindingDB:
Activity Spreadsheet -- Enzyme Inhibition Constant Data from BindingDB
Found 3 hits for monomerid = 186047
TargetBeta-secretase 1(Homo sapiens (Human))
Novartis
US Patent
LigandPNGBDBM186047(US9163011, 1)
Affinity DataIC50:  12nMpH: 4.5 T: 2°C. Assay description: Recombinant BACE-1 (extracellular domain, expressed in baculovirus and purified using standard methods) at 0.1 to 1 nM concentrations is incubated wi...
In DepthDetails US Patent
TargetAmyloid-beta precursor protein(Homo sapiens (Human))
Novartis
US Patent
LigandPNGBDBM186047(US9163011, 1)
Affinity DataIC50:  7nM. Assay description: Chinese hamster ovary cells are transfected with the human gene for amyloid precursor protein. The cells are plated at a density of 8000 cells/well i...
In DepthDetails US Patent
TargetBeta-secretase 2(Homo sapiens (Human))
Novartis
US Patent
LigandPNGBDBM186047(US9163011, 1)
Affinity DataIC50:  66nMpH: 4.5 T: 2°C. Assay description: Recombinant BACE-2 (extracellular domain, expressed in baculovirus and purified using standard methods) at 0.1 to 1 nM concentrations is incubated wi...
In DepthDetails US Patent