BDBM1888 1-[2-(2,6-difluorophenyl)ethyl]-3-(4-ethyl-1,3-thiazol-2-yl)thiourea::N-(2-(2,6-Difluorophenyl)ethyl)-N -(2-(4-ethylthiazolyl))thiourea::PETT Analog 55
SMILES CCc1csc(NC(=S)NCCc2c(F)cccc2F)n1
InChI Key InChIKey=JOHAYHVXYQNTLV-UHFFFAOYSA-N
Data  1 IC50
  Tab Delimited (TSV)   2D SDfile   Computed 3D by Vconf -m prep SDfile
Find this compound or compounds like it in BindingDB:
Activity Spreadsheet -- Enzyme Inhibition Constant Data from BindingDB
Found 1 hit for monomerid = 1888
TargetGag-Pol polyprotein [588-1027]/[588-1147](Human immunodeficiency virus type 1)
Eli Lilly
LigandPNGBDBM1888(1-[2-(2,6-difluorophenyl)ethyl]-3-(4-ethyl-1,3-thi...)
Affinity DataIC50:  5.5nMpH: 7.8 T: 2°C. Assay description: The IC50 of reverse transcriptase is the concentration that inhibits 50% of recombinant HIV-1 RT RNA-directed DNA polymerase activity in vitro.
In DepthDetails ArticlePubMed