BDBM189305 US9670194, Ex. 33 (S)-2-(1-((6-amino-5-(5-methyl-1,2,4-oxadiazol-3-yl)pyrimidin-4-yl)amino)-ethyl)-5-chloro-3-cyclopropylquinazolin-4(3H)-one
SMILES C[C@H](Nc1ncnc(N)c1-c1noc(C)n1)c1nc2cccc(Cl)c2c(=O)n1C1CC1
InChI Key InChIKey=HWZUVJKRMZEIDE-VIFPVBQESA-N
Data  1 IC50
  Tab Delimited (TSV)   2D SDfile   Computed 3D by Vconf -m prep SDfile
Find this compound or compounds like it in BindingDB:
Activity Spreadsheet -- Enzyme Inhibition Constant Data from BindingDB
Found 1 hit for monomerid = 189305
LigandPNGBDBM189305(US9670194, Ex. 33 (S)-2-(1-((6-amino-5-(5-methyl-1...)
Affinity DataIC50:  67nMT: 2°C. Assay description: PI3K (p110α/p85α) (h) is incubated in assay buffer containing 10 μM phosphatidylinositol 4,5-bisphosphate and MgATP (concentration as ...
Ligand InfoPC cidPC sid
In DepthDetails US Patent