BDBM189406 US9670194, Ex. 40 (S)-2-(1-((6-amino-5-(5-methyl-1,3,4-oxadiazol-2-yl)pyrimidin-4-yl)amino)-propyl)-5-fluoro-3-phenylquinazolin-4(3H)-one
SMILES CC[C@H](Nc1ncnc(N)c1-c1nnc(C)o1)c1nc2cccc(F)c2c(=O)n1-c1ccccc1
InChI Key InChIKey=BTGAIZVSUUOPDF-INIZCTEOSA-N
Data  1 IC50
  Tab Delimited (TSV)   2D SDfile   Computed 3D by Vconf -m prep SDfile
Find this compound or compounds like it in BindingDB:
Activity Spreadsheet -- Enzyme Inhibition Constant Data from BindingDB
Found 1 hit for monomerid = 189406
LigandPNGBDBM189406(US9670194, Ex. 40 (S)-2-(1-((6-amino-5-(5-methyl-1...)
Affinity DataIC50:  93nMT: 2°C. Assay description: PI3K (p110α/p85α) (h) is incubated in assay buffer containing 10 μM phosphatidylinositol 4,5-bisphosphate and MgATP (concentration as ...
Ligand InfoPC cidPC sid
In DepthDetails US Patent