BDBM189795 US9670194, Ex. 44 (S)-2-(1-((6-amino-5-(1-methyl-1H-1,2,4-triazol-3-yl)pyrimidin-4-yl)amino)-ethyl)-5-chloro-3-cyclopropylquinazolin-4(3H)-one
SMILES C[C@H](Nc1ncnc(N)c1-c1ncn(C)n1)c1nc2cccc(Cl)c2c(=O)n1C1CC1
InChI Key InChIKey=HCMWBXRHNIWOAT-JTQLQIEISA-N
Data  1 IC50
  Tab Delimited (TSV)   2D SDfile   Computed 3D by Vconf -m prep SDfile
Find this compound or compounds like it in BindingDB:
Activity Spreadsheet -- Enzyme Inhibition Constant Data from BindingDB
Found 1 hit for monomerid = 189795
LigandPNGBDBM189795(US9670194, Ex. 44 (S)-2-(1-((6-amino-5-(1-methyl-1...)
Affinity DataIC50:  358nMT: 2°C. Assay description: PI3K (p110α/p85α) (h) is incubated in assay buffer containing 10 μM phosphatidylinositol 4,5-bisphosphate and MgATP (concentration as ...
Ligand InfoPC cidPC sid
In DepthDetails US Patent