BDBM189843 US9670194, Ex. 62 2-((S)-1-((6-amino-5-(3-methyl-1,2,4-oxadiazol-5-yl)pyrimidin-4-yl)amino)propyl)-5-chloro-3-((1R,2S)-2-fluorocyclopropyl)quinazolin-4(3H)-one
SMILES CC[C@H](Nc1ncnc(N)c1-c1nc(C)no1)c1nc2cccc(Cl)c2c(=O)n1[C@@H]1C[C@@H]1F
InChI Key InChIKey=MARDRRMXZDSLJS-SGMGOOAPSA-N
Data  1 IC50
  Tab Delimited (TSV)   2D SDfile   Computed 3D by Vconf -m prep SDfile
Find this compound or compounds like it in BindingDB:
Activity Spreadsheet -- Enzyme Inhibition Constant Data from BindingDB
Found 1 hit for monomerid = 189843
LigandPNGBDBM189843(US9670194, Ex. 62 2-((S)-1-((6-amino-5-(3-methyl-1...)
Affinity DataIC50:  37nMT: 2°C. Assay description: PI3K (p110α/p85α) (h) is incubated in assay buffer containing 10 μM phosphatidylinositol 4,5-bisphosphate and MgATP (concentration as ...
Ligand InfoPC cidPC sid
In DepthDetails US Patent