BDBM192411 US9187462, II-21
SMILES COc1ccc(cc1F)[C@H](NC(=O)c1cc(F)c2cnc(N[C@@H](C)CO)nc2c1)c1cnn(C)c1
InChI Key InChIKey=AAEMNJKYSOIGGD-XMHCIUCPSA-N
Data  1 IC50
  Tab Delimited (TSV)   2D SDfile   Computed 3D by Vconf -m prep SDfile
Find this compound or compounds like it in BindingDB:
Activity Spreadsheet -- Enzyme Inhibition Constant Data from BindingDB
Found 1 hit for monomerid = 192411
TargetMitogen-activated protein kinase 1 [8-360](Homo sapiens (Human))
Array Biopharma
US Patent
LigandPNGBDBM192411(US9187462, II-21)
Affinity DataIC50:  2.30nMpH: 7.3Assay Description:Compounds were tested in an enzymatic assay using human ERK-2 (Mitogen Activated Kinase 1), recombinantly expressed as an N-terminal 6-His fusion pro...
In DepthDetails US Patent