BDBM192415 US9187462, II-25
SMILES Cn1cc(cn1)[C@@H](NC(=O)c1ccc2cnc(Nc3ccnn3C)nc2c1)c1ccc(Cl)c(F)c1
InChI Key InChIKey=KAVNWTJUHVNYDE-QFIPXVFZSA-N
Data  1 IC50
  Tab Delimited (TSV)   2D SDfile   Computed 3D by Vconf -m prep SDfile
Find this compound or compounds like it in BindingDB:
Activity Spreadsheet -- Enzyme Inhibition Constant Data from BindingDB
Found 1 hit for monomerid = 192415
TargetMitogen-activated protein kinase 1 [8-360](Homo sapiens (Human))
Array Biopharma
US Patent
LigandPNGBDBM192415(US9187462, II-25)
Affinity DataIC50:  3.10nMpH: 7.3Assay Description:Compounds were tested in an enzymatic assay using human ERK-2 (Mitogen Activated Kinase 1), recombinantly expressed as an N-terminal 6-His fusion pro...
In DepthDetails US Patent