BDBM193702 Pyrimidin-4-one-1,2,3-triazole conjugate, 3c
SMILES Cn1c(SCc2cn(nn2)-c2ccccc2Br)nc(cc1=O)-c1ccccc1
InChI Key InChIKey=SMSKNNAYNJBHGF-UHFFFAOYSA-N
Data  1 IC50
  Tab Delimited (TSV)   2D SDfile   Computed 3D by Vconf -m prep SDfile
Find this compound or compounds like it in BindingDB:
Activity Spreadsheet -- Enzyme Inhibition Constant Data from BindingDB
Found 1 hit for monomerid = 193702
TargetGlycogen synthase kinase-3 beta(Homo sapiens (Human))
Jamia Hamdard (Hamdard University)
LigandPNGBDBM193702(Pyrimidin-4-one-1,2,3-triazole conjugate, 3c)
Affinity DataIC50:  437nM. Assay description: In a typical assay, 10 µL of test compound of different concentrations (dissolved in dimethyl sulfoxide [DMSO] and diluted with assay buffer) and 10 ...
In DepthDetails ArticlePubMed