BDBM193706 Pyrimidin-4-one-1,2,3-triazole conjugate, 3g
SMILES CCc1ccc(cc1)-n1cc(CSc2nc(cc(=O)n2C)-c2ccccc2)nn1
InChI Key InChIKey=NZVCIPUDLCQSCY-UHFFFAOYSA-N
Data  1 IC50
  Tab Delimited (TSV)   2D SDfile   Computed 3D by Vconf -m prep SDfile
Find this compound or compounds like it in BindingDB:
Activity Spreadsheet -- Enzyme Inhibition Constant Data from BindingDB
Found 1 hit for monomerid = 193706
TargetGlycogen synthase kinase-3 beta(Homo sapiens (Human))
Jamia Hamdard (Hamdard University)
LigandPNGBDBM193706(Pyrimidin-4-one-1,2,3-triazole conjugate, 3g)
Affinity DataIC50:  94nM. Assay description: In a typical assay, 10 µL of test compound of different concentrations (dissolved in dimethyl sulfoxide [DMSO] and diluted with assay buffer) and 10 ...
In DepthDetails ArticlePubMed