BDBM194583 US9205085, MSX- 222
SMILES Fc1cccc(NCc2ccc(CNc3ncccn3)cc2)n1
InChI Key InChIKey=KDLZUFWRBSILHT-UHFFFAOYSA-N
Data  1 IC50
  Tab Delimited (TSV)   2D SDfile   Computed 3D by Vconf -m prep SDfile
Find this compound or compounds like it in BindingDB:
Activity Spreadsheet -- Enzyme Inhibition Constant Data from BindingDB
Found 1 hit for monomerid = 194583
TargetC-X-C chemokine receptor type 4(Rattus norvegicus (Rat))
Emory University
US Patent
LigandPNGBDBM194583(US9205085, MSX- 222)
Affinity DataIC50:  1nM. Assay description: A synthetic 14-mer peptide, TN14003, was previously reported to block both SDF-1/CXCR4 mediated invasion in vitro and metastasis in vivo with a high ...
Ligand InfoPC cidPC sid
In DepthDetails US Patent