BDBM194893 US9206184, 74
SMILES COc1cc(C)cc2cc(sc12)-c1c(CN2CCNC(=O)C2)c(n2ncnc(N)c12)C(C)(C)O
InChI Key InChIKey=QWKBMCGLZANBBQ-UHFFFAOYSA-N
Data  2 IC50
  Tab Delimited (TSV)   2D SDfile   Computed 3D by Vconf -m prep SDfile
Find this compound or compounds like it in BindingDB:
Activity Spreadsheet -- Enzyme Inhibition Constant Data from BindingDB
Found 2 hits for monomerid = 194893
TargetFibroblast growth factor receptor 3(Homo sapiens (Human))
Bayer Intellectual Property
US Patent
LigandPNGBDBM194893(US9206184, 74)
Affinity DataIC50:  1.40nMpH: 7.0 T: 2°C. Assay description: For the assay, 50 nl of each stock solution of the test compound in DMSO was pipetted into a black, low-volume 384-well microtiter plate (Greiner Bio...
Ligand InfoPC cidPC sid
In DepthDetails US Patent
TargetFibroblast growth factor receptor 1(Homo sapiens (Human))
Bayer Intellectual Property
US Patent
LigandPNGBDBM194893(US9206184, 74)
Affinity DataIC50:  4nMpH: 7.0 T: 2°C. Assay description: For the assay, 50 nl of each stock solution of the test compound in DMSO was pipetted into a black, low-volume 384-well microtiter plate (Greiner Bio...
Ligand InfoPC cidPC sid
In DepthDetails US Patent