BDBM196868 US9212192, 31
SMILES COc1cc(ccc1Nc1nc(Cc2c(Cl)cccc2Cl)c2nc[nH]c2c1C(N)=O)C(=O)NCCN(C)C
InChI Key InChIKey=RUOTYVMOIFNOMD-UHFFFAOYSA-N
Data  1 KI
  Tab Delimited (TSV)   2D SDfile   Computed 3D by Vconf -m prep SDfile
Find this compound or compounds like it in BindingDB:
Activity Spreadsheet -- Enzyme Inhibition Constant Data from BindingDB
Found 1 hit for monomerid = 196868
TargetALK tyrosine kinase receptor(Homo sapiens (Human))
Abbvie
US Patent
LigandPNGBDBM196868(US9212192, 31)
Affinity DataKi:  1nM ΔG°:  -12.3kcal/molepH: 7.4 T: 2°C. Assay description: ALK kinase assays were conducted with the indicated final concentrations unless otherwise specified. In 384 well black plates (Axygen), 8 ul of compo...
Ligand InfoPC cidPC sid
In DepthDetails US Patent