BDBM19738 2-Cyano-pyrimidine, 17c::2-cyano-4-[(2,2-dimethylpropyl)amino]-N-{2-[4-(pyrrolidin-1-yl)phenyl]ethyl}pyrimidine-5-carboxamide
SMILES CC(C)(C)CNc1nc(ncc1C(=O)NCCc1ccc(cc1)N1CCCC1)C#N
InChI Key InChIKey=PGLXWYLXLAJRJG-UHFFFAOYSA-N
Data  3 IC50
  Tab Delimited (TSV)   2D SDfile   Computed 3D by Vconf -m prep SDfile
Find this compound or compounds like it in BindingDB:
Activity Spreadsheet -- Enzyme Inhibition Constant Data from BindingDB
Found 3 hits for monomerid = 19738
TargetCathepsin K(Homo sapiens (Human))
Novartis Pharmaceuticals
LigandPNGBDBM19738(2-Cyano-pyrimidine, 17c | 2-cyano-4-[(2,2-dimethyl...)
Affinity DataIC50:  0.300nMpH: 7.0 T: 2°C. Assay description: The substrate hydrolysis with or without inhibitor was monitored at an excitation wavelength of 360nm and an emission wavelength of 460 nm on a fluor...
In DepthDetails ArticlePubMed
TargetCathepsin S(Homo sapiens (Human))
Novartis Pharmaceuticals
LigandPNGBDBM19738(2-Cyano-pyrimidine, 17c | 2-cyano-4-[(2,2-dimethyl...)
Affinity DataIC50: >10nM. Assay description: The substrate hydrolysis with or without inhibitor was monitored at an excitation wavelength of 360nm and an emission wavelength of 460 nm on a fluor...
In DepthDetails ArticlePubMed
TargetProcathepsin L(Homo sapiens (Human))
Novartis Pharmaceuticals
LigandPNGBDBM19738(2-Cyano-pyrimidine, 17c | 2-cyano-4-[(2,2-dimethyl...)
Affinity DataIC50: >10nMpH: 5.5 T: 2°C. Assay description: The substrate hydrolysis with or without inhibitor was monitored at an excitation wavelength of 360nm and an emission wavelength of 460 nm on a fluor...
In DepthDetails ArticlePubMed