BDBM199989 US9227959, 3
SMILES CC1(C)COCCN1C(=O)c1ccc(cn1)C#Cc1cccc(Cl)c1
InChI Key InChIKey=TVVKRRYSXWSDJT-UHFFFAOYSA-N
Data  1 KI
  Tab Delimited (TSV)   2D SDfile   Computed 3D by Vconf -m prep SDfile
Find this compound or compounds like it in BindingDB:
Activity Spreadsheet -- Enzyme Inhibition Constant Data from BindingDB
Found 1 hit for monomerid = 199989
TargetIsoform 1 of Metabotropic glutamate receptor 5 (5a)(Homo sapiens (Human))
Hoffmann-La Roche
US Patent
LigandPNGBDBM199989(US9227959, 3)
Affinity DataKi:  23nMpH: 7.4Assay Description:For binding experiments, cDNA encoding human mGlu 5a receptor was transiently transfected into EBNA cells using a procedure described by Schlaeger ...
Ligand InfoPC cidPC sid
In DepthDetails US Patent