BDBM20010 2-[4-({[3-(3-benzoyl-8-methylquinolin-4-yl)phenyl]amino}methyl)phenyl]acetic acid::phenyl acetic acid based quinoline, 22
SMILES Cc1cccc2c(-c3cccc(NCc4ccc(CC(O)=O)cc4)c3)c(cnc12)C(=O)c1ccccc1
InChI Key InChIKey=AJSJAQQMFKYODQ-UHFFFAOYSA-N
Data  2 IC50  1 EC50
  Tab Delimited (TSV)   2D SDfile   Computed 3D by Vconf -m prep SDfile
Find this compound or compounds like it in BindingDB:
Activity Spreadsheet -- Enzyme Inhibition Constant Data from BindingDB
Found 2 hits for monomerid = 20010
TargetOxysterols receptor LXR-beta [154-461](Homo sapiens (Human))
Wyeth Research
LigandPNGBDBM20010(2-[4-({[3-(3-benzoyl-8-methylquinolin-4-yl)phenyl]...)
Affinity DataIC50:  5.5nM EC50:  61nM. Assay description: Binding reaction was initiated by adding a dilution series of test compound in tracer solution to LXR-coated flash plates. Each concentration of test...
In DepthDetails ArticlePubMed
TargetOxysterols receptor LXR-alpha [197-447](Homo sapiens (Human))
Wyeth Research
LigandPNGBDBM20010(2-[4-({[3-(3-benzoyl-8-methylquinolin-4-yl)phenyl]...)
Affinity DataIC50:  18nMpH: 7.4 T: 2°C. Assay description: Binding reaction was initiated by adding a dilution series of test compound in tracer solution to LXR-coated flash plates. Each concentration of test...
In DepthDetails ArticlePubMed