BDBM20012 2-[4-({[3-(3-benzoyl-8-fluoroquinolin-4-yl)phenyl]amino}methyl)phenyl]acetic acid::phenyl acetic acid based quinoline, 24
SMILES OC(=O)Cc1ccc(CNc2cccc(c2)-c2c(cnc3c(F)cccc23)C(=O)c2ccccc2)cc1
InChI Key InChIKey=XUAMCPQLEJKSQK-UHFFFAOYSA-N
Data  2 IC50  1 EC50
  Tab Delimited (TSV)   2D SDfile   Computed 3D by Vconf -m prep SDfile
Find this compound or compounds like it in BindingDB:
Activity Spreadsheet -- Enzyme Inhibition Constant Data from BindingDB
Found 2 hits for monomerid = 20012
TargetOxysterols receptor LXR-beta [154-461](Homo sapiens (Human))
Wyeth Research
LigandPNGBDBM20012(2-[4-({[3-(3-benzoyl-8-fluoroquinolin-4-yl)phenyl]...)
Affinity DataIC50:  17nM EC50:  700nM. Assay description: Binding reaction was initiated by adding a dilution series of test compound in tracer solution to LXR-coated flash plates. Each concentration of test...
In DepthDetails ArticlePubMed
TargetOxysterols receptor LXR-alpha [197-447](Homo sapiens (Human))
Wyeth Research
LigandPNGBDBM20012(2-[4-({[3-(3-benzoyl-8-fluoroquinolin-4-yl)phenyl]...)
Affinity DataIC50:  104nMpH: 7.4 T: 2°C. Assay description: Binding reaction was initiated by adding a dilution series of test compound in tracer solution to LXR-coated flash plates. Each concentration of test...
In DepthDetails ArticlePubMed