BDBM20016 2-{3-[({3-[3-benzoyl-8-(trifluoromethyl)quinolin-4-yl]phenyl}amino)methyl]phenyl}acetic acid::phenyl acetic acid based quinoline, 28
SMILES OC(=O)Cc1cccc(CNc2cccc(c2)-c2c(cnc3c(cccc23)C(F)(F)F)C(=O)c2ccccc2)c1
InChI Key InChIKey=TUYZXSLKXBNYSH-UHFFFAOYSA-N
Data  2 IC50  1 EC50
  Tab Delimited (TSV)   2D SDfile   Computed 3D by Vconf -m prep SDfile
Find this compound or compounds like it in BindingDB:
Activity Spreadsheet -- Enzyme Inhibition Constant Data from BindingDB
Found 2 hits for monomerid = 20016
TargetOxysterols receptor LXR-beta [154-461](Homo sapiens (Human))
Wyeth Research
LigandPNGBDBM20016(2-{3-[({3-[3-benzoyl-8-(trifluoromethyl)quinolin-4...)
Affinity DataIC50:  6nM EC50:  141nM. Assay description: Binding reaction was initiated by adding a dilution series of test compound in tracer solution to LXR-coated flash plates. Each concentration of test...
In DepthDetails ArticlePubMed
TargetOxysterols receptor LXR-alpha [197-447](Homo sapiens (Human))
Wyeth Research
LigandPNGBDBM20016(2-{3-[({3-[3-benzoyl-8-(trifluoromethyl)quinolin-4...)
Affinity DataIC50:  33.6nMpH: 7.4 T: 2°C. Assay description: Binding reaction was initiated by adding a dilution series of test compound in tracer solution to LXR-coated flash plates. Each concentration of test...
In DepthDetails ArticlePubMed