BDBM200908 US9233946, 7
SMILES CC(C)c1ccc2sc(c(C)c2c1)S(=O)(=O)Nc1ncc(s1)C(O)=O
InChI Key InChIKey=VPYGNBKIDNDUGA-UHFFFAOYSA-N
Data  1 IC50
  Tab Delimited (TSV)   2D SDfile   Computed 3D by Vconf -m prep SDfile
Find this compound or compounds like it in BindingDB:
Activity Spreadsheet -- Enzyme Inhibition Constant Data from BindingDB
Found 1 hit for monomerid = 200908
Target6-phosphofructo-2-kinase/fructose-2,6-bisphosphatase 4(Homo sapiens (Human))
Kancera
US Patent
LigandPNGBDBM200908(US9233946, 7)
Affinity DataIC50:  100nM. Assay description: Method B: The kinase activity of the bi-functional enzyme is readily quantified based on the production of ADP and F-2,6-P2 from ATP and F6P. The ADP...
Ligand InfoPC cidPC sid
In DepthDetails US Patent