BDBM200943 US9233946, 42
SMILES COc1cccc2c(C)c(sc12)S(=O)(=O)Nc1cccc(c1)C(O)=O
InChI Key InChIKey=DZUYGSSDBJXOIB-UHFFFAOYSA-N
Data  1 IC50
  Tab Delimited (TSV)   2D SDfile   Computed 3D by Vconf -m prep SDfile
Find this compound or compounds like it in BindingDB:
Activity Spreadsheet -- Enzyme Inhibition Constant Data from BindingDB
Found 1 hit for monomerid = 200943
Target6-phosphofructo-2-kinase/fructose-2,6-bisphosphatase 4(Homo sapiens (Human))
Kancera
US Patent
LigandPNGBDBM200943(US9233946, 42)
Affinity DataIC50:  420nM. Assay description: Method B: The kinase activity of the bi-functional enzyme is readily quantified based on the production of ADP and F-2,6-P2 from ATP and F6P. The ADP...
Ligand InfoPC cidPC sid
In DepthDetails US Patent