BDBM20198 4-[(2S)-2-{[(2S)-1-[(2S)-2-{[(1S)-3-carbamoyl-1-{[(1S,2S)-1-carbamoyl-2-hydroxypropyl]carbamoyl}propyl]carbamoyl}pyrrolidin-1-yl]-4-methyl-1-oxopentan-2-yl]carbamoyl}-2-propanamidoethyl]phenoxyphosphonic acid::5, Propionyl-pTyr-Leu -Pro-Gln-Thr-NH2
SMILES CCC(=O)N[C@@H](Cc1ccc(OP(O)(O)=O)cc1)C(=O)N[C@@H](CC(C)C)C(=O)N1CCC[C@H]1C(=O)N[C@@H](CCC(N)=O)C(=O)N[C@@H](C(C)O)C(N)=O
InChI Key InChIKey=HRUKXKBTCNTFGW-AVWTVUIISA-N
Data  1 IC50
  Tab Delimited (TSV)   2D SDfile   Computed 3D by Vconf -m prep SDfile
Find this compound or compounds like it in BindingDB:
Activity Spreadsheet -- Enzyme Inhibition Constant Data from BindingDB
Found 1 hit for monomerid = 20198
TargetSignal transducer and activator of transcription 3(Mus musculus (mouse))
The University of Texas At Houston
LigandPNGBDBM20198(4-[(2S)-2-{[(2S)-1-[(2S)-2-{[(1S)-3-carbamoyl-1-{[...)
Affinity DataIC50:  497nMpH: 7.5 T: 2°C. Assay description: Fluorescence polarization (FP) binding assay is utilizing the intrinsic property of the fluorescent probe, which will have low polarization value whe...
In DepthDetails ArticlePubMed