BDBM20210 17, Ac-pTyr-Leu-4-hydroxy-Pro-Gln-Thr-NH2::4-[(2S)-2-{[(2S)-1-[(2S,4R)-2-{[(1S)-3-carbamoyl-1-{[(1S,2S)-1-carbamoyl-2-hydroxypropyl]carbamoyl}propyl]carbamoyl}-4-hydroxypyrrolidin-1-yl]-4-methyl-1-oxopentan-2-yl]carbamoyl}-2-acetamidoethyl]phenoxyphosphonic acid
SMILES CC(C)C[C@H](NC(=O)[C@H](Cc1ccc(OP(O)(O)=O)cc1)NC(C)=O)C(=O)N1C[C@H](O)C[C@H]1C(=O)N[C@@H](CCC(N)=O)C(=O)N[C@@H](C(C)O)C(N)=O
InChI Key InChIKey=GZXWWGNMEYCJPL-NHWXPJKWSA-N
Data  1 IC50
  Tab Delimited (TSV)   2D SDfile   Computed 3D by Vconf -m prep SDfile
Find this compound or compounds like it in BindingDB:
Activity Spreadsheet -- Enzyme Inhibition Constant Data from BindingDB
Found 1 hit for monomerid = 20210
TargetSignal transducer and activator of transcription 3(Mus musculus (mouse))
The University of Texas At Houston
LigandPNGBDBM20210(17, Ac-pTyr-Leu-4-hydroxy-Pro-Gln-Thr-NH2 | 4-[(2S...)
Affinity DataIC50:  484nMpH: 7.5 T: 2°C. Assay description: Fluorescence polarization (FP) binding assay is utilizing the intrinsic property of the fluorescent probe, which will have low polarization value whe...
In DepthDetails ArticlePubMed