BDBM20235 4-[(2S)-2-{[(2S)-1-[(2S)-2-{[(1S)-3-carbamoyl-1-{[(1R)-1-phenylethyl]carbamoyl}propyl]carbamoyl}pyrrolidin-1-yl]-4-methyl-1-oxopentan-2-yl]carbamoyl}-2-acetamidoethyl]phenoxyphosphonic acid::42, Ac-pTyr-Leu-Pro-Gln-NH(R)CHMePh
SMILES CC(C)C[C@H](NC(=O)[C@H](Cc1ccc(OP(O)(O)=O)cc1)NC(C)=O)C(=O)N1CCC[C@H]1C(=O)N[C@@H](CCC(N)=O)C(=O)N[C@H](C)c1ccccc1
InChI Key InChIKey=NIIYTMJMVQDCAJ-OAVBJPFCSA-N
Data  1 IC50
  Tab Delimited (TSV)   2D SDfile   Computed 3D by Vconf -m prep SDfile
Find this compound or compounds like it in BindingDB:
Activity Spreadsheet -- Enzyme Inhibition Constant Data from BindingDB
Found 1 hit for monomerid = 20235
TargetSignal transducer and activator of transcription 3(Mus musculus (mouse))
The University of Texas At Houston
LigandPNGBDBM20235(4-[(2S)-2-{[(2S)-1-[(2S)-2-{[(1S)-3-carbamoyl-1-{[...)
Affinity DataIC50:  801nM. Assay description: Fluorescence polarization (FP) binding assay is utilizing the intrinsic property of the fluorescent probe, which will have low polarization value whe...
In DepthDetails ArticlePubMed