BDBM202397 US9238644, 4
SMILES NC(=O)C1(CC1)c1ccccc1CCc1nc(Nc2ccc(cc2)C2CNC2)ncc1C(F)(F)F
InChI Key InChIKey=QXWHXZVEZDYDHA-UHFFFAOYSA-N
Data  3 IC50
  Tab Delimited (TSV)   2D SDfile   Computed 3D by Vconf -m prep SDfile
Find this compound or compounds like it in BindingDB:
Activity Spreadsheet -- Enzyme Inhibition Constant Data from BindingDB
Found 3 hits for monomerid = 202397
TargetVascular endothelial growth factor receptor 3(Homo sapiens (Human))
Cancer Therapeutics Crc Pty
US Patent
LigandPNGBDBM202397(US9238644, 4)
Affinity DataIC50:  22nMpH: 7.4Assay Description:A biotin labelled peptide is used as substrate (amino acid sequence: Biotin-Glu-Gly-Pro-Trp-Leu-Glu-Glu-Glu-Glu-Glu-Ala-Tyr-Gly-Trp-Met-Asp-Phe-NH2)....
Ligand InfoPC cidPC sid
In DepthDetails US Patent
TargetVascular endothelial growth factor receptor 2(Homo sapiens (Human))
Cancer Therapeutics Crc Pty
US Patent
LigandPNGBDBM202397(US9238644, 4)
Affinity DataIC50:  2.04E+3nMpH: 7.2 T: 2°C. Assay description: Adult human umbilical vein endothelial cells (HUVEC) (Cat# CC-2519, Lonza) were seeded into clear-bottom, TC treated 12 well plates (Cat #665180, G...
Ligand InfoPC cidPC sid
In DepthDetails US Patent
TargetVascular endothelial growth factor receptor 3(Homo sapiens (Human))
Cancer Therapeutics Crc Pty
US Patent
LigandPNGBDBM202397(US9238644, 4)
Affinity DataIC50:  38nMpH: 7.2 T: 2°C. Assay description: Adult human dermal lymphatic microvascular endothelial cells (HMVEC-dLyAD) (Cat# CC-2810, Lonza) were seeded into clear-bottom, TC treated 12 well pl...
Ligand InfoPC cidPC sid
In DepthDetails US Patent