BDBM204970 US9249085, I(ad)::US9624159, Compound I(ad)
SMILES Cc1cc(cc(CNc2c(F)ccc(OCC(O)=O)c2C)c1F)-c1cccc(F)c1
InChI Key InChIKey=HVEDJWCNDYQZDT-UHFFFAOYSA-N
Data  2 IC50  1 EC50
  Tab Delimited (TSV)   2D SDfile   Computed 3D by Vconf -m prep SDfile
Find this compound or compounds like it in BindingDB:
Activity Spreadsheet -- Enzyme Inhibition Constant Data from BindingDB
Found 3 hits for monomerid = 204970
TargetProstaglandin E2 receptor EP2 subtype(Homo sapiens (Human))
Fovea Pharmaceuticals
US Patent
LigandPNGBDBM204970(US9249085, I(ad) | US9624159, Compound I(ad))
Affinity DataEC50:  2nM. Assay description: Human CHO cells expressing the recombinant human prostanoid EP2 receptor were suspended in assay medium (HBSS buffer (Invitrogen) containing 20 mM HE...
Ligand InfoPC cidPC sid
In DepthDetails US Patent
TargetProstaglandin E2 receptor EP4 subtype(Homo sapiens (Human))
Sanofi
US Patent
LigandPNGBDBM204970(US9249085, I(ad) | US9624159, Compound I(ad))
Affinity DataIC50: >300nM. Assay description: Cell membrane homogenate from Human embryonic kidney HEK-293(T) cells expressing recombinant human prostanoid EP4 receptor was used to perform Prosta...
Ligand InfoPC cidPC sid
In DepthDetails US Patent
TargetProstaglandin E2 receptor EP4 subtype(Homo sapiens (Human))
Sanofi
US Patent
LigandPNGBDBM204970(US9249085, I(ad) | US9624159, Compound I(ad))
Affinity DataIC50: >300nMpH: 6.0Assay Description:The competition reaction was initiated by incubation of membrane protein homogenate (20 μg protein) for 120 min at 22° C. with 0.5 nM [3H]PGE2 l...
Ligand InfoPC cidPC sid
In DepthDetails US Patent