BDBM205008 US9550781, 5::n-(3-(3-(9h-purin-6-yl)pyridin-2-ylamino)-4-chlorophenyl)propane-1-sulfonamide
SMILES CCCS(=O)(=O)Nc1ccc(Cl)c(Nc2ncccc2-c2ncnc3[nH]cnc23)c1
InChI Key InChIKey=CUVTVXCACUQQKZ-UHFFFAOYSA-N
Data  1 IC50
  Tab Delimited (TSV)   2D SDfile   Computed 3D by Vconf -m prep SDfile
Find this compound or compounds like it in BindingDB:
Activity Spreadsheet -- Enzyme Inhibition Constant Data from BindingDB
Found 1 hit for monomerid = 205008
TargetNuclear receptor coactivator 2 [740-753]()
Centaurus Biopharma
US Patent
LigandPNGBDBM205008(US9550781, 5 | n-(3-(3-(9h-purin-6-yl)pyridin-2-yl...)
Affinity DataIC50: <100nM. Assay description: In vitro B-RAF Kinase Assay. To determine iIn vitro activities of recombinant B-RAF enzyme, a Homogeneous Time-Resolved Fluorescence (HTRF) assay was...
Ligand InfoPC cidPC sid
In DepthDetails US Patent