BDBM205023 US9550781, 20::n-(3-(3-(9h-purin-6-yl)pyridin-2-ylamino)-2,4-difluorophenyl)ethenesulfonamide
SMILES Fc1ccc(NS(=O)(=O)C=C)c(F)c1Nc1ncccc1-c1ncnc2[nH]cnc12
InChI Key InChIKey=VFBJLLKJJMEGRT-UHFFFAOYSA-N
Data  1 IC50
  Tab Delimited (TSV)   2D SDfile   Computed 3D by Vconf -m prep SDfile
Find this compound or compounds like it in BindingDB:
Activity Spreadsheet -- Enzyme Inhibition Constant Data from BindingDB
Found 1 hit for monomerid = 205023
TargetNuclear receptor coactivator 2 [740-753]()
Centaurus Biopharma
US Patent
LigandPNGBDBM205023(US9550781, 20 | n-(3-(3-(9h-purin-6-yl)pyridin-2-y...)
Affinity DataIC50: <500nM. Assay description: In vitro B-RAF Kinase Assay. To determine iIn vitro activities of recombinant B-RAF enzyme, a Homogeneous Time-Resolved Fluorescence (HTRF) assay was...
Ligand InfoPC cidPC sid
In DepthDetails US Patent