BDBM205207 US9249114, A33
SMILES COCCNCc1ccc(cc1)C(=O)Nc1sc(nc1C(N)=O)-c1ccncc1
InChI Key InChIKey=VQAVTPGDFOJCLZ-UHFFFAOYSA-N
Data  1 IC50
  Tab Delimited (TSV)   2D SDfile   Computed 3D by Vconf -m prep SDfile
Find this compound or compounds like it in BindingDB:
Activity Spreadsheet -- Enzyme Inhibition Constant Data from BindingDB
Found 1 hit for monomerid = 205207
TargetSerine/threonine-protein kinase TBK1(Homo sapiens (Human))
Merck Patent
US Patent
LigandPNGBDBM205207(US9249114, A33)
Affinity DataIC50:  260nMpH: 7.5 T: 2°C. Assay description: The kinase assay is performed as 384-well Flashplate assay assay (for e.g. Topcount measurement. 0.6 nM TANK binding kinase (TBK1), 800 nM biotinyl...
Ligand InfoPC cidPC sid
In DepthDetails US Patent