BDBM207236 US9260439, 213
SMILES COC(=O)N1CC[C@@](C)(C1)N1CCc2c1nc(nc2-c1cnc(N)nc1)N1CCOCC1
InChI Key InChIKey=KEPIQLTVJCPYMV-NRFANRHFSA-N
Data  4 KI  3 IC50
  Tab Delimited (TSV)   2D SDfile   Computed 3D by Vconf -m prep SDfile
Find this compound or compounds like it in BindingDB:
Activity Spreadsheet -- Enzyme Inhibition Constant Data from BindingDB
Found 7 hits for monomerid = 207236
LigandPNGBDBM207236(US9260439, 213)
Affinity DataKi: <0.0230nM. Assay description: Inhibition of recombinant human full-length PI3K p110alpha/p85alpha (322 to 600) expressed in baculovirus infected Sf21 cells using phosphatidylinosi...
Ligand InfoPC cidPC sid
In DepthDetails ArticlePubMed
LigandPNGBDBM207236(US9260439, 213)
Affinity DataKi:  0.0300nM. Assay description: PI3KA_Act: Genes encoding for full length p110alpha and p85alpha nSH-iSH2=niSH2 (p85a aminoacids 322-600) subunits of PI3Kalpha complex were subclone...
Ligand InfoPC cidPC sid
In DepthDetails US Patent
LigandPNGBDBM207236(US9260439, 213)
Affinity DataKi: <0.280nM. Assay description: Inhibition of recombinant human PI3K p110delta/p85alpha using phosphatidylinositol 4,5-bisphosphate as substrate preincubated for 15 mins followed by...
Ligand InfoPC cidPC sid
In DepthDetails ArticlePubMed
LigandPNGBDBM207236(US9260439, 213)
Affinity DataKi:  0.790nM. Assay description: Inhibition of recombinant human PI3K p110beta/p85alpha using phosphatidylinositol 4,5-bisphosphate as substrate preincubated for 15 mins followed by ...
Ligand InfoPC cidPC sid
In DepthDetails ArticlePubMed
LigandPNGBDBM207236(US9260439, 213)
Affinity DataIC50:  45nM. Assay description: Inhibition of recombinant human N-terminal Myr signal and C-terminal Flag-tagged PI3K p110beta expressed in rat Rat1 cells
Ligand InfoPC cidPC sid
In DepthDetails ArticlePubMed
LigandPNGBDBM207236(US9260439, 213)
Affinity DataIC50:  13nM. Assay description: Inhibition of recombinant human N-terminal Myr signal and C-terminal Flag-tagged PI3K p110delta expressed in rat Rat1 cells
Ligand InfoPC cidPC sid
In DepthDetails ArticlePubMed
LigandPNGBDBM207236(US9260439, 213)
Affinity DataIC50:  5nM. Assay description: Inhibition of recombinant human N-terminal Myr signal and C-terminal Flag-tagged PI3K p110alpha expressed in rat Rat1 cells
Ligand InfoPC cidPC sid
In DepthDetails ArticlePubMed