BDBM207887 US9266832, Cpd044
SMILES FC(F)(F)c1cccc(Cc2cccc(c2)C(=O)NCCc2c[nH]c3ccc(Cl)cc23)c1
InChI Key InChIKey=SIRMPUITJBVHHB-UHFFFAOYSA-N
Data  1 EC50
  Tab Delimited (TSV)   2D SDfile   Computed 3D by Vconf -m prep SDfile
Find this compound or compounds like it in BindingDB:
Activity Spreadsheet -- Enzyme Inhibition Constant Data from BindingDB
Found 1 hit for monomerid = 207887
TargetAlpha-synuclein(Homo sapiens (Human))
Katholieke Universiteit Levun
US Patent
LigandPNGBDBM207887(US9266832, Cpd044)
Affinity DataEC50:  55nM. Assay description: α-Synucleinopathies are characterised by aggregation of α-synuclein in neurons. Aggregation of purified α-synuclein is performed essen...
Ligand InfoPC cidPC sid
In DepthDetails US Patent