BDBM207926 US9266832, Cpd083
SMILES Clc1ccc2[nH]cc(CCNC(=O)c3cccc(Cc4ccoc4)c3)c2c1
InChI Key InChIKey=HNHGSHQBIDTPML-UHFFFAOYSA-N
Data  1 EC50
  Tab Delimited (TSV)   2D SDfile   Computed 3D by Vconf -m prep SDfile
Find this compound or compounds like it in BindingDB:
Activity Spreadsheet -- Enzyme Inhibition Constant Data from BindingDB
Found 1 hit for monomerid = 207926
TargetAlpha-synuclein(Homo sapiens (Human))
Katholieke Universiteit Levun
US Patent
LigandPNGBDBM207926(US9266832, Cpd083)
Affinity DataEC50:  56nM. Assay description: α-Synucleinopathies are characterised by aggregation of α-synuclein in neurons. Aggregation of purified α-synuclein is performed essen...
Ligand InfoPC cidPC sid
In DepthDetails US Patent