BDBM208709 US9266876, 176
SMILES C[C@@H]1CN(CCN1C(=O)Cn1nccc1C)c1sc(nc1-c1nc2ccccc2[nH]1)C(F)(F)F
InChI Key InChIKey=PTFZVOMXBCKEKH-CQSZACIVSA-N
Data  1 IC50
  Tab Delimited (TSV)   2D SDfile   Computed 3D by Vconf -m prep SDfile
Find this compound or compounds like it in BindingDB:
Activity Spreadsheet -- Enzyme Inhibition Constant Data from BindingDB
Found 1 hit for monomerid = 208709
TargetC-X-C chemokine receptor type 3/Guanine nucleotide-binding protein subunit alpha-15(Homo sapiens (Human))
Actelion Pharmaceuticals
US Patent
LigandPNGBDBM208709(US9266876, 176)
Affinity DataIC50:  0.100nMpH: 7.4 T: 2°C. Assay description: The bioactivity of compounds is tested in a fluorometric imaging plate reader (FLIPR: Molecular Devices) using engineered CHO-K1 cells expressing the...
Ligand InfoPC cidPC sid
In DepthDetails US Patent