BDBM208772 US9266876, 239
SMILES C[C@@H]1CN(CCN1C(=O)Cn1nc(C)nc1C)c1sc(nc1-c1nc2cc(CCN)ccc2[nH]1)C(F)(F)F
InChI Key InChIKey=RGCMDFOKPCNRJN-CYBMUJFWSA-N
Data  1 IC50
  Tab Delimited (TSV)   2D SDfile   Computed 3D by Vconf -m prep SDfile
Find this compound or compounds like it in BindingDB:
Activity Spreadsheet -- Enzyme Inhibition Constant Data from BindingDB
Found 1 hit for monomerid = 208772
TargetC-X-C chemokine receptor type 3/Guanine nucleotide-binding protein subunit alpha-15(Homo sapiens (Human))
Actelion Pharmaceuticals
US Patent
LigandPNGBDBM208772(US9266876, 239)
Affinity DataIC50:  0.100nMpH: 7.4 T: 2°C. Assay description: The bioactivity of compounds is tested in a fluorometric imaging plate reader (FLIPR: Molecular Devices) using engineered CHO-K1 cells expressing the...
Ligand InfoPC cidPC sid
In DepthDetails US Patent