BDBM210944 4-(2-(3-chlorophenyl)-1H-pyrrol-1-yl)-2-(((1r,4r)-4-hydroxycyclohexyl)amino)benzamide (5f)::US10975030, Compound 5f
SMILES NC(=O)c1ccc(cc1NC1CCC(O)CC1)-n1cccc1-c1cccc(Cl)c1
InChI Key InChIKey=JFHWJOARVMEILU-UHFFFAOYSA-N
Data  3 Kd
  Tab Delimited (TSV)   2D SDfile   Computed 3D by Vconf -m prep SDfile
Find this compound or compounds like it in BindingDB:
Activity Spreadsheet -- Enzyme Inhibition Constant Data from BindingDB
Found 3 hits for monomerid = 210944
TargetEndoplasmin(Homo sapiens (Human))
The University of Kansas
LigandPNGBDBM210944(4-(2-(3-chlorophenyl)-1H-pyrrol-1-yl)-2-(((1r,4r)-...)
Affinity DataKd:  1.58E+4nMpH: 7.3Assay Description:Assay buffer (25 μL, 20 mM HEPES at pH 7.3, 50 mM KCl, 5 mM MgCl2, 1 mM DTT, 20 mM Na2MoO4, 0.01% NP-40, and 0.5 mg mL−1 BGG) was added to...
Ligand InfoPC cidPC sid
In DepthDetails ArticlePubMed
TargetHeat shock protein HSP 90-alpha(Homo sapiens (Human))
University of Kansas
US Patent
LigandPNGBDBM210944(4-(2-(3-chlorophenyl)-1H-pyrrol-1-yl)-2-(((1r,4r)-...)
Affinity DataKd: >1.00E+5nM. Assay description: Assay buffer (25 μL, 20 mM HEPES pH 7.3, 50 mM KCl, 5 mM MgCl2, 1 mM DTT, 20 mM Na2MoO4, 0.01% NP-40, and 0.5 mg/mL BGG) was added to 96-well pl...
Ligand InfoPC cidPC sid
In DepthDetails US Patent
TargetHeat shock protein HSP 90-alpha(Homo sapiens (Human))
University of Kansas
US Patent
LigandPNGBDBM210944(4-(2-(3-chlorophenyl)-1H-pyrrol-1-yl)-2-(((1r,4r)-...)
Affinity DataKd: >1.00E+5nMpH: 7.3Assay Description:Assay buffer (25 μL, 20 mM HEPES at pH 7.3, 50 mM KCl, 5 mM MgCl2, 1 mM DTT, 20 mM Na2MoO4, 0.01% NP-40, and 0.5 mg mL−1 BGG) was added to...
Ligand InfoPC cidPC sid
In DepthDetails ArticlePubMed