BDBM21193 N-[6-(3,5-dimethyl-1H-pyrazol-1-yl)-2-(5-methylfuran-2-yl)pyrimidin-4-yl]-2-(4-methyl-1,4-diazepan-1-yl)acetamide::Pyrimidin-4-ylacetamide, 7
SMILES CN1CCCN(CC(=O)Nc2cc(nc(n2)-c2ccc(C)o2)-n2nc(C)cc2C)CC1
InChI Key InChIKey=NDSMOKBIZMIYDJ-UHFFFAOYSA-N
Data  3 KI  1 IC50
  Tab Delimited (TSV)   2D SDfile   Computed 3D by Vconf -m prep SDfile
Find this compound or compounds like it in BindingDB:
Activity Spreadsheet -- Enzyme Inhibition Constant Data from BindingDB
Found 4 hits for monomerid = 21193
TargetAdenosine receptor A2a(Homo sapiens (Human))
Neuroscience
LigandPNGBDBM21193(N-[6-(3,5-dimethyl-1H-pyrazol-1-yl)-2-(5-methylfur...)
Affinity DataKi:  10nM ΔG°:  -10.8kcal/molepH: 7.4 T: 2°C. Assay description: The membranes prepared from Flp-In HEK cells transfected with adenosine receptors were used in binding assays. Nonspecific binding was determined in ...
In DepthDetails ArticlePubMed
TargetAdenosine receptor A2a(Rattus norvegicus (rat))
Neuroscience
LigandPNGBDBM21193(N-[6-(3,5-dimethyl-1H-pyrazol-1-yl)-2-(5-methylfur...)
Affinity DataKi:  46.7nM ΔG°:  -9.89kcal/molepH: 7.4 T: 2°C. Assay description: The membranes prepared from Flp-In HEK cells transfected with adenosine receptors were used in binding assays. Nonspecific binding was determined in ...
In DepthDetails ArticlePubMed
TargetAdenosine receptor A1(Homo sapiens (Human))
Neuroscience
LigandPNGBDBM21193(N-[6-(3,5-dimethyl-1H-pyrazol-1-yl)-2-(5-methylfur...)
Affinity DataKi:  2.10E+3nM. Assay description: The membranes prepared from Flp-In HEK cells transfected with adenosine receptors were used in binding assays. Nonspecific binding was determined in ...
In DepthDetails ArticlePubMed
TargetPotassium voltage-gated channel subfamily H member 2(Homo sapiens (Human))
Neuroscience
LigandPNGBDBM21193(N-[6-(3,5-dimethyl-1H-pyrazol-1-yl)-2-(5-methylfur...)
Affinity DataIC50:  285nM. Assay description: A preclinical assay was used to determine whether drug candidates inhibit hERG by examining their ability to block the potassium tail currents in HEK...
In DepthDetails ArticlePubMed