BDBM211974 US9290485, 6
SMILES Cc1cc(N)nc(C)c1CNC(=O)c1cn(Cc2ccc(Cn3cccn3)cc2)cn1
InChI Key InChIKey=OUKWTWSWNLIIED-UHFFFAOYSA-N
Data  2 IC50
  Tab Delimited (TSV)   2D SDfile   Computed 3D by Vconf -m prep SDfile
Find this compound or compounds like it in BindingDB:
Activity Spreadsheet -- Enzyme Inhibition Constant Data from BindingDB
Found 2 hits for monomerid = 211974
TargetPlasma kallikrein(Homo sapiens (Human))TBA
LigandPNGBDBM211974(US9290485, 6)
Affinity DataIC50:  0.200nM. Assay description: Inhibition of human plasma kallikrein incubated for 1 hrs
Ligand InfoPC cidPC sid
In DepthDetails PubMed
TargetPlasma kallikrein(Homo sapiens (Human))TBA
LigandPNGBDBM211974(US9290485, 6)
Affinity DataIC50:  0.200nMpH: 7.8 T: 2°C. Assay description: Enzymatic reactions were conducted in â¿¿assay bufferâ¿¿, comprising 50 mM Hepes/NaOH at pH 7.8, 150 mM NaCl, 1 mM EDTA and 0.05% (w/v) CHAPS. For th...
Ligand InfoPC cidPC sid
In DepthDetails US Patent