BDBM21204 N-[6-(3,5-dimethyl-1H-pyrazol-1-yl)-2-(5-methylfuran-2-yl)pyrimidin-4-yl]-2-[(3R)-3-(dimethylamino)pyrrolidin-1-yl]acetamide::Pyrimidin-4-ylacetamide, 14
SMILES CN(C)[C@@H]1CCN(CC(=O)Nc2cc(nc(n2)-c2ccc(C)o2)-n2nc(C)cc2C)C1
InChI Key InChIKey=FJQPCZJPOCTEEK-QGZVFWFLSA-N
Data  2 KI
  Tab Delimited (TSV)   2D SDfile   Computed 3D by Vconf -m prep SDfile
Find this compound or compounds like it in BindingDB:
Activity Spreadsheet -- Enzyme Inhibition Constant Data from BindingDB
Found 2 hits for monomerid = 21204
TargetAdenosine receptor A2a(Homo sapiens (Human))
Neuroscience
LigandPNGBDBM21204(N-[6-(3,5-dimethyl-1H-pyrazol-1-yl)-2-(5-methylfur...)
Affinity DataKi:  4nM ΔG°:  -11.3kcal/molepH: 7.4 T: 2°C. Assay description: The membranes prepared from Flp-In HEK cells transfected with adenosine receptors were used in binding assays. Nonspecific binding was determined in ...
In DepthDetails ArticlePubMed
TargetAdenosine receptor A1(Homo sapiens (Human))
Neuroscience
LigandPNGBDBM21204(N-[6-(3,5-dimethyl-1H-pyrazol-1-yl)-2-(5-methylfur...)
Affinity DataKi:  262nM. Assay description: The membranes prepared from Flp-In HEK cells transfected with adenosine receptors were used in binding assays. Nonspecific binding was determined in ...
In DepthDetails ArticlePubMed